Reaction Details
TargetCarbonic anhydrase 2
LigandBDBM50164087
Substrate/Competitorn/a
Meas. Tech.ChEMBL_302182 (CHEMBL830215)
Ki 9400000±n/a nM
Citation Innocenti, AAntel, JWurl, MVullo, DFirnges, MAScozzafava, ASupuran, CT Carbonic anhydrase inhibitors. Inhibition of isozymes I, II, IV, V and IX with complex fluorides, chlorides and cyanides. Bioorg Med Chem Lett15:1909-13 (2005) 
 
Carbonic anhydrase 2
Name:Carbonic anhydrase 2
Type:Enzyme
Mol. Mass.:29250.71
Organism:Homo sapiens (Human)
Description:P00918
Residue:260
BDBM50164087
NameBDBM50164087
Synonyms:AsF6- | CHEMBL181880
TypeSmall organic molecule
Emp. Form.AsF6
Mol. Mass.188.9126
SMILESF[As-](F)(F)(F)(F)F