Reaction Details
TargetCarbonic anhydrase 5A, mitochondrial
LigandBDBM50164080
Substrate/Competitorn/a
Meas. Tech.ChEMBL_302181 (CHEMBL830214)
Ki 1750000±n/a nM
Citation Innocenti, AAntel, JWurl, MVullo, DFirnges, MAScozzafava, ASupuran, CT Carbonic anhydrase inhibitors. Inhibition of isozymes I, II, IV, V and IX with complex fluorides, chlorides and cyanides. Bioorg Med Chem Lett15:1909-13 (2005) 
 
Carbonic anhydrase 5A, mitochondrial
Name:Carbonic anhydrase 5A, mitochondrial
Type:Enzyme
Mol. Mass.:34755.54
Organism:Homo sapiens (Human)
Description:Human (cloned) isozyme
Residue:305
BDBM50164080
NameBDBM50164080
Synonyms:CHEMBL359634 | [Ag(CN)2]-
TypeSmall organic molecule
Emp. Form.C2AgN2
Mol. Mass.159.9035
SMILESN#C[Ag-]C#N