Reaction Details
TargetCarbonic anhydrase 2
LigandBDBM36130
Substrate/Competitorn/a
Meas. Tech.ChEMBL_302182 (CHEMBL830215)
Ki 17500000±n/a nM
Citation Innocenti, AAntel, JWurl, MVullo, DFirnges, MAScozzafava, ASupuran, CT Carbonic anhydrase inhibitors. Inhibition of isozymes I, II, IV, V and IX with complex fluorides, chlorides and cyanides. Bioorg Med Chem Lett15:1909-13 (2005) 
 
Carbonic anhydrase 2
Name:Carbonic anhydrase 2
Type:Enzyme
Mol. Mass.:29250.71
Organism:Homo sapiens (Human)
Description:P00918
Residue:260
BDBM36130
NameBDBM36130
Synonyms:CHEMBL181124 | sodium hexafluorophosphate
TypeGuest
Emp. Form.F6P
Mol. Mass.144.96473
SMILESF[P-](F)(F)(F)(F)F