Reaction Details
TargetCarbonic anhydrase 5A, mitochondrial
LigandBDBM50164087
Substrate/Competitorn/a
Meas. Tech.ChEMBL_302181 (CHEMBL830214)
Ki 75600000.0±n/a nM
Citation Innocenti, AAntel, JWurl, MVullo, DFirnges, MAScozzafava, ASupuran, CT Carbonic anhydrase inhibitors. Inhibition of isozymes I, II, IV, V and IX with complex fluorides, chlorides and cyanides. Bioorg Med Chem Lett15:1909-13 (2005) 
 
Carbonic anhydrase 5A, mitochondrial
Name:Carbonic anhydrase 5A, mitochondrial
Type:Enzyme
Mol. Mass.:34755.54
Organism:Homo sapiens (Human)
Description:Human (cloned) isozyme
Residue:305
BDBM50164087
NameBDBM50164087
Synonyms:AsF6- | CHEMBL181880
TypeSmall organic molecule
Emp. Form.AsF6
Mol. Mass.188.9126
SMILESF[As-](F)(F)(F)(F)F