Reaction Details
TargetCarbonic anhydrase 4
LigandBDBM50164088
Substrate/Competitorn/a
Meas. Tech.ChEMBL_302185 (CHEMBL829425)
Ki 1690000±n/a nM
Citation Innocenti, AAntel, JWurl, MVullo, DFirnges, MAScozzafava, ASupuran, CT Carbonic anhydrase inhibitors. Inhibition of isozymes I, II, IV, V and IX with complex fluorides, chlorides and cyanides. Bioorg Med Chem Lett15:1909-13 (2005) 
 
Carbonic anhydrase 4
Name:Carbonic anhydrase 4
Type:Enzyme
Mol. Mass.:35037.98
Organism:Homo sapiens (Human)
Description:P22748
Residue:312
BDBM50164088
NameBDBM50164088
Synonyms:CHEMBL362447 | [Pd(CN)4]2-
TypeSmall organic molecule
Emp. Form.C4N4Pd
Mol. Mass.210.49
SMILESN#C[Pd--](C#N)(C#N)C#N