Reaction Details
TargetWee1-like protein kinase
LigandBDBM50164115
Substrate/Competitorn/a
Meas. Tech.ChEMBL_304894 (CHEMBL829373)
IC50 3500±n/a nM
Citation Palmer, BDSmaill, JBRewcastle, GWDobrusin, EMKraker, AMoore, CWSteinkampf, RWDenny, WA Structure-activity relationships for 2-anilino-6-phenylpyrido[2,3-d]pyrimidin-7(8H)-ones as inhibitors of the cellular checkpoint kinase Wee1. Bioorg Med Chem Lett15:1931-5 (2005) 
 
Wee1-like protein kinase
Name:Wee1-like protein kinase
Type:PROTEIN
Mol. Mass.:71599.12
Organism:Homo sapiens (Human)
Description:ChEMBL_1445054
Residue:646
BDBM50164115
NameBDBM50164115
Synonyms:6-(2,6-Dichloro-3-hydroxymethyl-phenyl)-8-methyl-2-phenylamino-8H-pyrido[2,3-d]pyrimidin-7-one | CHEMBL180035
TypeSmall organic molecule
Emp. Form.C21H16Cl2N4O2
Mol. Mass.427.283
SMILESCn1c2nc(Nc3ccccc3)ncc2cc(-c2c(Cl)ccc(CO)c2Cl)c1=O