Reaction Details
TargetWee1-like protein kinase
LigandBDBM3105
Substrate/Competitorn/a
Meas. Tech.ChEMBL_304894 (CHEMBL829373)
IC50 32±n/a nM
Citation Palmer, BDSmaill, JBRewcastle, GWDobrusin, EMKraker, AMoore, CWSteinkampf, RWDenny, WA Structure-activity relationships for 2-anilino-6-phenylpyrido[2,3-d]pyrimidin-7(8H)-ones as inhibitors of the cellular checkpoint kinase Wee1. Bioorg Med Chem Lett15:1931-5 (2005) 
 
Wee1-like protein kinase
Name:Wee1-like protein kinase
Type:PROTEIN
Mol. Mass.:71599.12
Organism:Homo sapiens (Human)
Description:ChEMBL_1445054
Residue:646
BDBM3105
NameBDBM3105
Synonyms:2-aminopyrido[2,3-d]pyrimidin-7(8H)-one 72 CHEMBL113070 | PD 166285 analog
TypeSmall organic molecule
Emp. Form.C24H20Cl2N4O3
Mol. Mass.483.347
SMILESCn1c2nc(Nc3ccc(CCCC(O)=O)cc3)ncc2cc(-c2c(Cl)cccc2Cl)c1=O