Reaction Details
TargetWee1-like protein kinase
LigandBDBM50164133
Substrate/Competitorn/a
Meas. Tech.ChEMBL_304894 (CHEMBL829373)
IC50>50000±n/a nM
Citation Palmer, BDSmaill, JBRewcastle, GWDobrusin, EMKraker, AMoore, CWSteinkampf, RWDenny, WA Structure-activity relationships for 2-anilino-6-phenylpyrido[2,3-d]pyrimidin-7(8H)-ones as inhibitors of the cellular checkpoint kinase Wee1. Bioorg Med Chem Lett15:1931-5 (2005) 
 
Wee1-like protein kinase
Name:Wee1-like protein kinase
Type:PROTEIN
Mol. Mass.:71599.12
Organism:Homo sapiens (Human)
Description:ChEMBL_1445054
Residue:646
BDBM50164133
NameBDBM50164133
Synonyms:6-(2,6-Dichloro-3,5-dimethoxy-phenyl)-8-methyl-2-phenylamino-8H-pyrido[2,3-d]pyrimidin-7-one | CHEMBL361574
TypeSmall organic molecule
Emp. Form.C22H18Cl2N4O3
Mol. Mass.457.309
SMILESCOc1cc(OC)c(Cl)c(c1Cl)-c1cc2cnc(Nc3ccccc3)nc2n(C)c1=O