Reaction Details
TargetWee1-like protein kinase
LigandBDBM50164113
Substrate/Competitorn/a
Meas. Tech.ChEMBL_304894 (CHEMBL829373)
IC50 250±n/a nM
Citation Palmer, BDSmaill, JBRewcastle, GWDobrusin, EMKraker, AMoore, CWSteinkampf, RWDenny, WA Structure-activity relationships for 2-anilino-6-phenylpyrido[2,3-d]pyrimidin-7(8H)-ones as inhibitors of the cellular checkpoint kinase Wee1. Bioorg Med Chem Lett15:1931-5 (2005) 
 
Wee1-like protein kinase
Name:Wee1-like protein kinase
Type:PROTEIN
Mol. Mass.:71599.12
Organism:Homo sapiens (Human)
Description:ChEMBL_1445054
Residue:646
BDBM50164113
NameBDBM50164113
Synonyms:2-{4-[6-(2,6-Dichloro-phenyl)-8-methyl-7-oxo-7,8-dihydro-pyrido[2,3-d]pyrimidin-2-ylamino]-phenoxy}-acetamide | CHEMBL369296
TypeSmall organic molecule
Emp. Form.C22H17Cl2N5O3
Mol. Mass.470.308
SMILESCn1c2nc(Nc3ccc(OCC(N)=O)cc3)ncc2cc(-c2c(Cl)cccc2Cl)c1=O