Reaction Details
TargetWee1-like protein kinase
LigandBDBM50164114
Substrate/Competitorn/a
Meas. Tech.ChEMBL_304894 (CHEMBL829373)
IC50 8600±n/a nM
Citation Palmer, BDSmaill, JBRewcastle, GWDobrusin, EMKraker, AMoore, CWSteinkampf, RWDenny, WA Structure-activity relationships for 2-anilino-6-phenylpyrido[2,3-d]pyrimidin-7(8H)-ones as inhibitors of the cellular checkpoint kinase Wee1. Bioorg Med Chem Lett15:1931-5 (2005) 
 
Wee1-like protein kinase
Name:Wee1-like protein kinase
Type:PROTEIN
Mol. Mass.:71599.12
Organism:Homo sapiens (Human)
Description:ChEMBL_1445054
Residue:646
BDBM50164114
NameBDBM50164114
Synonyms:2,4-Dichloro-3-(8-methyl-7-oxo-2-phenylamino-7,8-dihydro-pyrido[2,3-d]pyrimidin-6-yl)-benzamide | CHEMBL179806
TypeSmall organic molecule
Emp. Form.C21H15Cl2N5O2
Mol. Mass.440.282
SMILESCn1c2nc(Nc3ccccc3)ncc2cc(-c2c(Cl)ccc(C(N)=O)c2Cl)c1=O