Reaction Details
TargetWee1-like protein kinase
LigandBDBM50164134
Substrate/Competitorn/a
Meas. Tech.ChEMBL_304894 (CHEMBL829373)
IC50 40±n/a nM
Citation Palmer, BDSmaill, JBRewcastle, GWDobrusin, EMKraker, AMoore, CWSteinkampf, RWDenny, WA Structure-activity relationships for 2-anilino-6-phenylpyrido[2,3-d]pyrimidin-7(8H)-ones as inhibitors of the cellular checkpoint kinase Wee1. Bioorg Med Chem Lett15:1931-5 (2005) 
 
Wee1-like protein kinase
Name:Wee1-like protein kinase
Type:PROTEIN
Mol. Mass.:71599.12
Organism:Homo sapiens (Human)
Description:ChEMBL_1445054
Residue:646
BDBM50164134
NameBDBM50164134
Synonyms:4-{4-[6-(2,6-Dichloro-4-hydroxy-phenyl)-8-methyl-7-oxo-7,8-dihydro-pyrido[2,3-d]pyrimidin-2-ylamino]-phenoxy}-butyric acid | CHEMBL181314
TypeSmall organic molecule
Emp. Form.C24H20Cl2N4O5
Mol. Mass.515.345
SMILESCn1c2nc(Nc3ccc(OCCCC(O)=O)cc3)ncc2cc(-c2c(Cl)cc(O)cc2Cl)c1=O