Reaction Details
TargetWee1-like protein kinase
LigandBDBM50164150
Substrate/Competitorn/a
Meas. Tech.ChEMBL_304894 (CHEMBL829373)
IC50 41000±n/a nM
Citation Palmer, BDSmaill, JBRewcastle, GWDobrusin, EMKraker, AMoore, CWSteinkampf, RWDenny, WA Structure-activity relationships for 2-anilino-6-phenylpyrido[2,3-d]pyrimidin-7(8H)-ones as inhibitors of the cellular checkpoint kinase Wee1. Bioorg Med Chem Lett15:1931-5 (2005) 
 
Wee1-like protein kinase
Name:Wee1-like protein kinase
Type:PROTEIN
Mol. Mass.:71599.12
Organism:Homo sapiens (Human)
Description:ChEMBL_1445054
Residue:646
BDBM50164150
NameBDBM50164150
Synonyms:6-(2,6-Bis-trifluoromethyl-phenyl)-8-methyl-2-phenylamino-8H-pyrido[2,3-d]pyrimidin-7-one | CHEMBL181871
TypeSmall organic molecule
Emp. Form.C22H14F6N4O
Mol. Mass.464.3632
SMILESCn1c2nc(Nc3ccccc3)ncc2cc(-c2c(cccc2C(F)(F)F)C(F)(F)F)c1=O