Reaction Details
TargetWee1-like protein kinase
LigandBDBM50164148
Substrate/Competitorn/a
Meas. Tech.ChEMBL_304894 (CHEMBL829373)
IC50 150±n/a nM
Citation Palmer, BDSmaill, JBRewcastle, GWDobrusin, EMKraker, AMoore, CWSteinkampf, RWDenny, WA Structure-activity relationships for 2-anilino-6-phenylpyrido[2,3-d]pyrimidin-7(8H)-ones as inhibitors of the cellular checkpoint kinase Wee1. Bioorg Med Chem Lett15:1931-5 (2005) 
 
Wee1-like protein kinase
Name:Wee1-like protein kinase
Type:PROTEIN
Mol. Mass.:71599.12
Organism:Homo sapiens (Human)
Description:ChEMBL_1445054
Residue:646
BDBM50164148
NameBDBM50164148
Synonyms:6-(2,6-Dichloro-3-hydroxy-phenyl)-2-[4-(2-diethylamino-ethoxy)-phenylamino]-8-methyl-8H-pyrido[2,3-d]pyrimidin-7-one | CHEMBL181423
TypeSmall organic molecule
Emp. Form.C26H27Cl2N5O3
Mol. Mass.528.43
SMILESCCN(CC)CCOc1ccc(Nc2ncc3cc(-c4c(Cl)ccc(O)c4Cl)c(=O)n(C)c3n2)cc1