Reaction Details
TargetWee1-like protein kinase
LigandBDBM50164156
Substrate/Competitorn/a
Meas. Tech.ChEMBL_304894 (CHEMBL829373)
IC50 69.0±n/a nM
Citation Palmer, BDSmaill, JBRewcastle, GWDobrusin, EMKraker, AMoore, CWSteinkampf, RWDenny, WA Structure-activity relationships for 2-anilino-6-phenylpyrido[2,3-d]pyrimidin-7(8H)-ones as inhibitors of the cellular checkpoint kinase Wee1. Bioorg Med Chem Lett15:1931-5 (2005) 
 
Wee1-like protein kinase
Name:Wee1-like protein kinase
Type:PROTEIN
Mol. Mass.:71599.12
Organism:Homo sapiens (Human)
Description:ChEMBL_1445054
Residue:646
BDBM50164156
NameBDBM50164156
Synonyms:6-(2,6-Dichloro-phenyl)-8-methyl-2-{4-[3-(5H-tetrazol-5-yl)-propyl]-phenylamino}-8H-pyrido[2,3-d]pyrimidin-7-one | CHEMBL178510
TypeSmall organic molecule
Emp. Form.C24H20Cl2N8O
Mol. Mass.507.375
SMILESCn1c2nc(Nc3ccc(CCCC4N=NN=N4)cc3)ncc2cc(-c2c(Cl)cccc2Cl)c1=O