Reaction Details
TargetProtein-glutamine gamma-glutamyltransferase K
LigandBDBM50164216
Substrate/Competitorn/a
Meas. Tech.ChEMBL_304809 (CHEMBL827899)
IC50 6200±n/a nM
Citation Leung-Toung, RTam, TFWodzinska, JMZhao, YLowrie, JSimpson, CDKarimian, KSpino, M 3-Substituted imidazo[1,2-d][1,2,4]-thiadiazoles: a novel class of factor XIIIa inhibitors. J Med Chem48:2266-9 (2005) 
 
Protein-glutamine gamma-glutamyltransferase K
Name:Protein-glutamine gamma-glutamyltransferase K
Type:Protein
Mol. Mass.:89778.63
Organism:Homo sapiens (Human)
Description:n/a
Residue:817
BDBM50164216
NameBDBM50164216
Synonyms:CHEMBL190022 | N-[6-(Imidazo[1,2-d][1,2,4]thiadiazol-3-yl-methyl-amino)-hexyl]-2-nitro-benzenesulfonamide
TypeSmall organic molecule
Emp. Form.C17H22N6O4S2
Mol. Mass.438.524
SMILESCN(CCCCCCNS(=O)(=O)c1ccccc1[N+]([O-])=O)c1n[s+]c2[n-]ccn12