Reaction Details
TargetProtein-glutamine gamma-glutamyltransferase K
LigandBDBM50164222
Substrate/Competitorn/a
Meas. Tech.ChEMBL_304809 (CHEMBL827899)
IC50 8100±n/a nM
Citation Leung-Toung, RTam, TFWodzinska, JMZhao, YLowrie, JSimpson, CDKarimian, KSpino, M 3-Substituted imidazo[1,2-d][1,2,4]-thiadiazoles: a novel class of factor XIIIa inhibitors. J Med Chem48:2266-9 (2005) 
 
Protein-glutamine gamma-glutamyltransferase K
Name:Protein-glutamine gamma-glutamyltransferase K
Type:Protein
Mol. Mass.:89778.63
Organism:Homo sapiens (Human)
Description:n/a
Residue:817
BDBM50164222
NameBDBM50164222
Synonyms:CHEMBL193212 | N-[6-(Imidazo[1,2-d][1,2,4]thiadiazol-3-ylamino)-hexyl]-2-nitro-benzenesulfonamide
TypeSmall organic molecule
Emp. Form.C16H20N6O4S2
Mol. Mass.424.498
SMILES[O-][N+](=O)c1ccccc1S(=O)(=O)NCCCCCCNc1n[s+]c2[n-]ccn12