Reaction Details
TargetCoagulation factor XIII A chain
LigandBDBM50164227
Substrate/Competitorn/a
Meas. Tech.ChEMBL_304794 (CHEMBL877318)
IC50 100±n/a nM
Citation Leung-Toung, RTam, TFWodzinska, JMZhao, YLowrie, JSimpson, CDKarimian, KSpino, M 3-Substituted imidazo[1,2-d][1,2,4]-thiadiazoles: a novel class of factor XIIIa inhibitors. J Med Chem48:2266-9 (2005) 
 
Coagulation factor XIII A chain
Name:Coagulation factor XIII A chain
Type:PROTEIN
Mol. Mass.:83261.29
Organism:Homo sapiens (Human)
Description:ChEMBL_1475048
Residue:732
BDBM50164227
NameBDBM50164227
Synonyms:5-Methyl-2-(2-oxo-propylsulfanyl)-thiazolo[2,3-b][1,3,4]thiadiazol-4-ylium; compound with perchlorate | CHEMBL193220
TypeSmall organic molecule
Emp. Form.C8H9N2OS3
Mol. Mass.245.364
SMILESCC(=O)CSc1n[n+]2c(C)csc2s1