Reaction Details
TargetMitogen-activated protein kinase 14
LigandBDBM50164228
Substrate/Competitorn/a
Meas. Tech.ChEMBL_306714 (CHEMBL832299)
IC50 4.2±n/a nM
Citation de Dios, AShih, CLópez de Uralde, BSánchez, Cdel Prado, MMartín Cabrejas, LMPleite, SBlanco-Urgoiti, JLorite, MJNevill, CRBonjouklian, RYork, JVieth, MWang, YMagnus, NCampbell, RMAnderson, BDMcCann, DJGiera, DDLee, PASchultz, RMLi, LCJohnson, LMWolos, JA Design of potent and selective 2-aminobenzimidazole-based p38alpha MAP kinase inhibitors with excellent in vivo efficacy. J Med Chem48:2270-3 (2005) 
 
Mitogen-activated protein kinase 14
Name:Mitogen-activated protein kinase 14
Type:Serine/threonine-protein kinase
Mol. Mass.:41286.76
Organism:Homo sapiens (Human)
Description:Q16539
Residue:360
BDBM50164228
NameBDBM50164228
Synonyms:1-(isopropylsulfonyl)-6-(4-phenyl-1H-imidazol-5-yl)-1H-benzo[d]imidazol-2-amine CHEMBL192848
TypeSmall organic molecule
Emp. Form.C19H19N5O2S
Mol. Mass.381.451
SMILESCC(C)S(=O)(=O)n1c(N)nc2ccc(cc12)-c1[nH]cnc1-c1ccccc1