Reaction Details
TargetMelanin-concentrating hormone receptor 1
LigandBDBM50164246
Substrate/Competitorn/a
Meas. Tech.ChEMBL_302593 (CHEMBL839553)
Ki 3±n/a nM
Citation McBriar, MDGuzik, HXu, RParuchova, JLi, SPalani, AClader, JWGreenlee, WJHawes, BEKowalski, TJO'Neill, KSpar, BWeig, B Discovery of bicycloalkyl urea melanin concentrating hormone receptor antagonists: orally efficacious antiobesity therapeutics. J Med Chem48:2274-7 (2005) 
 
Melanin-concentrating hormone receptor 1
Name:Melanin-concentrating hormone receptor 1
Type:PROTEIN
Mol. Mass.:39133.74
Organism:Mus musculus
Description:ChEMBL_818502
Residue:353
BDBM50164246
NameBDBM50164246
Synonyms:1-[(1S,2R,5S)-5-(4-Cyano-phenyl)-bicyclo[3.1.0]hex-2-yl]-3-(4-fluoro-3-trifluoromethyl-phenyl)-1-[4-(4-methyl-piperazin-1-yl)-butyl]-urea | CHEMBL190842
TypeSmall organic molecule
Emp. Form.C30H35F4N5O
Mol. Mass.557.6254
SMILESCN1CCN(CCCCN([C@@H]2CC[C@@]3(C[C@H]23)c2ccc(cc2)C#N)C(=O)Nc2ccc(F)c(c2)C(F)(F)F)CC1