Reaction Details
TargetProthrombin
LigandBDBM50164256
Substrate/Competitorn/a
Meas. Tech.ChEMBL_302313 (CHEMBL828902)
Ki 0.550000±n/a nM
Citation Stauffer, KJWilliams, PDSelnick, HGNantermet, PGNewton, CLHomnick, CFZrada, MMLewis, SDLucas, BJKrueger, JAPietrak, BLLyle, EASingh, RMiller-Stein, CWhite, RBWong, BWallace, AASitko, GRCook, JJHolahan, MAStranieri-Michener, MLeonard, YMLynch, JJMcMasters, DRYan, Y 9-hydroxyazafluorenes and their use in thrombin inhibitors. J Med Chem48:2282-93 (2005) 
 
Prothrombin
Name:Prothrombin
Type:Protein
Mol. Mass.:70029.57
Organism:Homo sapiens (Human)
Description:P00734
Residue:622
BDBM50164256
NameBDBM50164256
Synonyms:(S)-1-(2-Hydroxy-2,2-diphenyl-acetyl)-pyrrolidine-2-carboxylic acid 2-aminomethyl-5-chloro-benzylamide | CHEMBL191062
TypeSmall organic molecule
Emp. Form.C27H28ClN3O3
Mol. Mass.477.983
SMILESNCc1ccc(Cl)cc1CNC(=O)[C@@H]1CCCN1C(=O)C(O)(c1ccccc1)c1ccccc1