Reaction Details
TargetProthrombin
LigandBDBM50164259
Substrate/Competitorn/a
Meas. Tech.ChEMBL_302313 (CHEMBL828902)
Ki 3.30±n/a nM
Citation Stauffer, KJWilliams, PDSelnick, HGNantermet, PGNewton, CLHomnick, CFZrada, MMLewis, SDLucas, BJKrueger, JAPietrak, BLLyle, EASingh, RMiller-Stein, CWhite, RBWong, BWallace, AASitko, GRCook, JJHolahan, MAStranieri-Michener, MLeonard, YMLynch, JJMcMasters, DRYan, Y 9-hydroxyazafluorenes and their use in thrombin inhibitors. J Med Chem48:2282-93 (2005) 
 
Prothrombin
Name:Prothrombin
Type:Protein
Mol. Mass.:70029.57
Organism:Homo sapiens (Human)
Description:P00734
Residue:622
BDBM50164259
NameBDBM50164259
Synonyms:(S)-1-(9-Hydroxy-9H-indeno[2,1-b]pyridine-9-carbonyl)-pyrrolidine-2-carboxylic acid 2-aminomethyl-5-chloro-benzylamide | CHEMBL192378
TypeSmall organic molecule
Emp. Form.C26H25ClN4O3
Mol. Mass.476.955
SMILESNCc1ccc(Cl)cc1CNC(=O)[C@@H]1CCCN1C(=O)C1(O)c2ccccc2-c2cccnc12