Reaction Details
TargetSerine protease 1
LigandBDBM50164260
Substrate/Competitorn/a
Meas. Tech.ChEMBL_302454 (CHEMBL827150)
Ki 300±n/a nM
Citation Stauffer, KJWilliams, PDSelnick, HGNantermet, PGNewton, CLHomnick, CFZrada, MMLewis, SDLucas, BJKrueger, JAPietrak, BLLyle, EASingh, RMiller-Stein, CWhite, RBWong, BWallace, AASitko, GRCook, JJHolahan, MAStranieri-Michener, MLeonard, YMLynch, JJMcMasters, DRYan, Y 9-hydroxyazafluorenes and their use in thrombin inhibitors. J Med Chem48:2282-93 (2005) 
 
Serine protease 1
Name:Serine protease 1
Type:Enzyme
Mol. Mass.:26557.80
Organism:Homo sapiens (Human)
Description:P07477
Residue:247
BDBM50164260
NameBDBM50164260
Synonyms:(S)-1-(7-Chloro-5-hydroxy-5H-indeno[1,2-b]pyridine-5-carbonyl)-pyrrolidine-2-carboxylic acid 2-aminomethyl-5-chloro-benzylamide | CHEMBL191441
TypeSmall organic molecule
Emp. Form.C26H24Cl2N4O3
Mol. Mass.511.4
SMILESNCc1ccc(Cl)cc1CNC(=O)[C@@H]1CCCN1C(=O)C1(O)c2cc(Cl)ccc2-c2ncccc12