Reaction Details
TargetTissue-type plasminogen activator
LigandBDBM50164263
Substrate/Competitorn/a
Meas. Tech.ChEMBL_302563 (CHEMBL839525)
Ki>100000±n/a nM
Citation Stauffer, KJWilliams, PDSelnick, HGNantermet, PGNewton, CLHomnick, CFZrada, MMLewis, SDLucas, BJKrueger, JAPietrak, BLLyle, EASingh, RMiller-Stein, CWhite, RBWong, BWallace, AASitko, GRCook, JJHolahan, MAStranieri-Michener, MLeonard, YMLynch, JJMcMasters, DRYan, Y 9-hydroxyazafluorenes and their use in thrombin inhibitors. J Med Chem48:2282-93 (2005) 
 
Tissue-type plasminogen activator
Name:Tissue-type plasminogen activator
Type:Enzyme
Mol. Mass.:62931.08
Organism:Homo sapiens (Human)
Description:n/a
Residue:562
BDBM50164263
NameBDBM50164263
Synonyms:(S)-1-(9-Hydroxy-9H-3-aza-fluorene-9-carbonyl)-pyrrolidine-2-carboxylic acid 2-aminomethyl-5-chloro-benzylamide | CHEMBL372449
TypeSmall organic molecule
Emp. Form.C26H25ClN4O3
Mol. Mass.476.955
SMILESNCc1ccc(Cl)cc1CNC(=O)[C@@H]1CCCN1C(=O)C1(O)c2ccccc2-c2cnccc12