Reaction Details
TargetD(2) dopamine receptor
LigandBDBM84637
Substrate/Competitorn/a
Meas. Tech.ChEMBL_303214 (CHEMBL829839)
Ki 63±n/a nM
Citation Boeckler, FOhnmacht, ULehmann, TUtz, WHübner, HGmeiner, P CoMFA and CoMSIA investigations revealing novel insights into the binding modes of dopamine D3 receptor agonists. J Med Chem48:2493-508 (2005) 
 
D(2) dopamine receptor
Name:D(2) dopamine receptor
Type:Cell-surface receptors
Mol. Mass.:50647.10
Organism:Homo sapiens (Human)
Description:P14416
Residue:443
BDBM84637
NameBDBM84637
Synonyms:CAS_85760-74-3 NSC_54562 Quinpirole,(-) | US9359372, Quinpirole
TypeSmall organic molecule
Emp. Form.C13H21N3
Mol. Mass.219.3259
SMILESCCCN1CCC[C@@H]2Cc3[nH]ncc3C[C@@H]12