Reaction Details
TargetD(3) dopamine receptor
LigandBDBM50105731
Substrate/Competitorn/a
Meas. Tech.ChEMBL_303192 (CHEMBL829818)
Ki 5.3±n/a nM
Citation Boeckler, FOhnmacht, ULehmann, TUtz, WHübner, HGmeiner, P CoMFA and CoMSIA investigations revealing novel insights into the binding modes of dopamine D3 receptor agonists. J Med Chem48:2493-508 (2005) 
 
D(3) dopamine receptor
Name:D(3) dopamine receptor
Type:n/a
Mol. Mass.:44243.43
Organism:Homo sapiens (Human)
Description:n/a
Residue:400
BDBM50105731
NameBDBM50105731
Synonyms:(S)-7-Dipropylamino-5,6,7,8-tetrahydro-indolizine-3-carbaldehyde | CHEMBL316983
TypeSmall organic molecule
Emp. Form.C15H24N2O
Mol. Mass.248.3639
SMILESCCCN(CCC)[C@H]1CCn2c(C1)ccc2C=O