Reaction Details
TargetCannabinoid receptor 1
LigandBDBM50164429
Substrate/Competitorn/a
Meas. Tech.ChEMBL_302943 (CHEMBL841778)
Ki 589±n/a nM
Citation Muccioli, GGMartin, DScriba, GKPoppitz, WPoupaert, JHWouters, JLambert, DM Substituted 5,5'-diphenyl-2-thioxoimidazolidin-4-one as CB1 cannabinoid receptor ligands: synthesis and pharmacological evaluation. J Med Chem48:2509-17 (2005) 
 
Cannabinoid receptor 1
Name:Cannabinoid receptor 1
Type:G Protein-Coupled Receptor (GPCR)
Mol. Mass.:52868.96
Organism:Homo sapiens (Human)
Description:P21554
Residue:472
BDBM50164429
NameBDBM50164429
Synonyms:3-Allyl-5,5-bis-(4-iodo-phenyl)-2-thioxo-imidazolidin-4-one | CHEMBL190316
TypeSmall organic molecule
Emp. Form.C18H14I2N2OS
Mol. Mass.560.191
SMILESIc1ccc(cc1)C1(NC(=S)N(CC=C)C1=O)c1ccc(I)cc1