Reaction Details
TargetCannabinoid receptor 1
LigandBDBM50067498
Substrate/Competitorn/a
Meas. Tech.ChEMBL_302943 (CHEMBL841778)
Ki 18.6±n/a nM
Citation Muccioli, GGMartin, DScriba, GKPoppitz, WPoupaert, JHWouters, JLambert, DM Substituted 5,5'-diphenyl-2-thioxoimidazolidin-4-one as CB1 cannabinoid receptor ligands: synthesis and pharmacological evaluation. J Med Chem48:2509-17 (2005) 
 
Cannabinoid receptor 1
Name:Cannabinoid receptor 1
Type:G Protein-Coupled Receptor (GPCR)
Mol. Mass.:52868.96
Organism:Homo sapiens (Human)
Description:P21554
Residue:472
BDBM50067498
NameBDBM50067498
Synonyms:(6aS,10aS)-3-(1,1-Dimethyl-heptyl)-9-hydroxymethyl-6,6-dimethyl-6a,7,10,10a-tetrahydro-6H-benzo[c]chromen-1-ol (6aS,7S)-3-(1,1-Dimethyl-heptyl)-9-hydroxymethyl-6,6-dimethyl-6a,7,10,10a-tetrahydro-6H-benzo[c]chromen-1-ol HU-210 | HU-211
TypeSmall organic molecule
Emp. Form.C25H38O3
Mol. Mass.386.5674
SMILESCCCCCCC(C)(C)c1cc(O)c2[C@H]3CC(CO)=CC[C@@H]3C(C)(C)Oc2c1