Reaction Details
TargetGlutamate receptor ionotropic, NMDA 1/2B
LigandBDBM50164549
Substrate/Competitorn/a
Meas. Tech.ChEMBL_303759 (CHEMBL828982)
Ki 250±n/a nM
Citation Morley, RMTse, HWFeng, BMiller, JCMonaghan, DTJane, DE Synthesis and pharmacology of N1-substituted piperazine-2,3-dicarboxylic acid derivatives acting as NMDA receptor antagonists. J Med Chem48:2627-37 (2005) 
 
Glutamate receptor ionotropic, NMDA 1/2B
Name:Glutamate receptor ionotropic, NMDA 1/2B
Type:n/a
Mol. Mass.:n/a
Description:ASSAY_ID of EBI is 141026
Components:This complex has 2 components.
Component 1
Name:Glutamate receptor ionotropic, NMDA 2B
Synonyms:GluN2B Grin2b NMDA receptor subunit N2B (GluN2B) NMDE2_RAT | NR2B
Type:Protein
Mol. Mass.:166077.66
Organism:Rattus norvegicus (Rat)
Description:Q00960
Residue:1482
Component 2
Name:Glutamate receptor ionotropic, NMDA 1
Synonyms:Glutamate (NMDA) receptor subunit zeta 1 Glutamate-NMDA-Channel Glutamate-NMDA-Polyamine NMDA Nmdar1 | phencyclidine
Type:Enzyme Catalytic Domain
Mol. Mass.:105533.40
Organism:RAT
Description:P35439
Residue:938
BDBM50164549
NameBDBM50164549
Synonyms:(2R,3S)-1-(7-Bromo-phenanthrene-2-carbonyl)-piperazine-2,3-dicarboxylic acid | CHEMBL192866
TypeSmall organic molecule
Emp. Form.C21H17BrN2O5
Mol. Mass.457.274
SMILESOC(=O)[C@H]1NCCN([C@H]1C(O)=O)C(=O)c1ccc2c(ccc3cc(Br)ccc23)c1