Reaction Details
TargetNitric oxide synthase, inducible
LigandBDBM50164777
Substrate/Competitorn/a
Meas. Tech.ChEMBL_305446 (CHEMBL877003)
IC50 15.0±n/a nM
Citation Guthikonda, RNShah, SKPacholok, SGHumes, JLMumford, RAGrant, SKChabin, RMGreen, BGTsou, NBall, RFletcher, DSLuell, SEuan MacIntyre, DMaccoss, M Bicyclic amidine inhibitors of nitric oxide synthase: discovery of perhydro-iminopyrindine and perhydro-iminoquinoline as potent, orally active inhibitors of inducible nitric oxide synthase. Bioorg Med Chem Lett15:1997-2001 (2005) 
 
Nitric oxide synthase, inducible
Name:Nitric oxide synthase, inducible
Type:Homodimer
Mol. Mass.:131141.95
Organism:Homo sapiens (Human)
Description:P35228
Residue:1153
BDBM50164777
NameBDBM50164777
Synonyms:(4R,4aR,7aR)-4-Methyl-octahydro-[1]pyrindin-(2E)-ylideneamine CHEMBL191242
TypeSmall organic molecule
Emp. Form.C9H16N2
Mol. Mass.152.2367
SMILESC[C@@H]1CC(N)=N[C@@H]2CCC[C@H]12