Reaction Details
TargetNitric oxide synthase, inducible
LigandBDBM50164782
Substrate/Competitorn/a
Meas. Tech.ChEMBL_305446 (CHEMBL877003)
IC50 22±n/a nM
Citation Guthikonda, RNShah, SKPacholok, SGHumes, JLMumford, RAGrant, SKChabin, RMGreen, BGTsou, NBall, RFletcher, DSLuell, SEuan MacIntyre, DMaccoss, M Bicyclic amidine inhibitors of nitric oxide synthase: discovery of perhydro-iminopyrindine and perhydro-iminoquinoline as potent, orally active inhibitors of inducible nitric oxide synthase. Bioorg Med Chem Lett15:1997-2001 (2005) 
 
Nitric oxide synthase, inducible
Name:Nitric oxide synthase, inducible
Type:Homodimer
Mol. Mass.:131141.95
Organism:Homo sapiens (Human)
Description:P35228
Residue:1153
BDBM50164782
NameBDBM50164782
Synonyms:(4R,4aR,5R)-4-Methyl-octahydro-quinolin-(2E)-ylideneamine | CHEMBL191675
TypeSmall organic molecule
Emp. Form.C10H18N2
Mol. Mass.166.2633
SMILESC[C@@H]1CC(N)=N[C@@H]2CCCC[C@H]12