Reaction Details
TargetNitric oxide synthase, inducible
LigandBDBM50049255
Substrate/Competitorn/a
Meas. Tech.ChEMBL_305446 (CHEMBL877003)
IC50 300±n/a nM
Citation Guthikonda, RNShah, SKPacholok, SGHumes, JLMumford, RAGrant, SKChabin, RMGreen, BGTsou, NBall, RFletcher, DSLuell, SEuan MacIntyre, DMaccoss, M Bicyclic amidine inhibitors of nitric oxide synthase: discovery of perhydro-iminopyrindine and perhydro-iminoquinoline as potent, orally active inhibitors of inducible nitric oxide synthase. Bioorg Med Chem Lett15:1997-2001 (2005) 
 
Nitric oxide synthase, inducible
Name:Nitric oxide synthase, inducible
Type:Homodimer
Mol. Mass.:131141.95
Organism:Homo sapiens (Human)
Description:P35228
Residue:1153
BDBM50049255
NameBDBM50049255
Synonyms:CHEMBL269058 Piperidin-(2E)-ylideneamine | Piperidin-(2Z)-ylideneamine
TypeSmall organic molecule
Emp. Form.C5H10N2
Mol. Mass.98.1463
SMILESNC1=NCCCC1