Reaction Details
TargetCystic fibrosis transmembrane conductance regulator
LigandBDBM50164973
Substrate/Competitorn/a
Meas. Tech.ChEMBL_310547 (CHEMBL833631)
EC50 590±n/a nM
Citation Hirth, BHQiao, SCuff, LMCochran, BMPregel, MJGregory, JSSneddon, SFKane, JL Discovery of 1,2,3,4-tetrahydroisoquinoline-3-carboxylic acid diamides that increase CFTR mediated chloride transport. Bioorg Med Chem Lett15:2087-91 (2005) 
 
Cystic fibrosis transmembrane conductance regulator
Name:Cystic fibrosis transmembrane conductance regulator
Type:Enzyme Catalytic Domain
Mol. Mass.:168171.30
Organism:Homo sapiens (Human)
Description:gi_90421313
Residue:1480
BDBM50164973
NameBDBM50164973
Synonyms:(R)-2-[3-(4-Fluoro-phenoxy)-benzoyl]-1,2,3,4-tetrahydro-isoquinoline-3-carboxylic acid (4-chloro-phenyl)-amide | CHEMBL195151
TypeSmall organic molecule
Emp. Form.C29H22ClFN2O3
Mol. Mass.500.948
SMILESFc1ccc(Oc2cccc(c2)C(=O)N2Cc3ccccc3C[C@@H]2C(=O)Nc2ccc(Cl)cc2)cc1