Reaction Details
TargetMuscarinic acetylcholine receptor M3
LigandBDBM50165018
Substrate/Competitorn/a
Meas. Tech.ChEMBL_302413 (CHEMBL828817)
Ki 50±n/a nM
Citation Kaur, KAeron, SBruhaspathy, MShetty, SJGupta, SHegde, LHSilamkoti, ADMehta, AChugh, AGupta, JBSarma, PKKumar, N Design, synthesis and activity of novel derivatives of oxybutynin and tolterodine. Bioorg Med Chem Lett15:2093-6 (2005) 
 
Muscarinic acetylcholine receptor M3
Name:Muscarinic acetylcholine receptor M3
Type:Enzyme Catalytic Domain
Mol. Mass.:66086.66
Organism:RAT
Description:Cholinergic, muscarinic M3 CHRM3 RAT::P08483
Residue:589
BDBM50165018
NameBDBM50165018
Synonyms:2-((1R,5S)-3-3-Aza-bicyclo[3.1.0]hex-3-yl-1-phenyl-propyl)-4-methyl-phenol | CHEMBL190815
TypeSmall organic molecule
Emp. Form.C21H25NO
Mol. Mass.307.4293
SMILESCc1ccc(O)c(c1)C(CCN1C[C@@H]2C[C@@H]2C1)c1ccccc1