Reaction Details
TargetMuscarinic acetylcholine receptor M2
LigandBDBM50165012
Substrate/Competitorn/a
Meas. Tech.ChEMBL_302412 (CHEMBL875203)
Ki 31±n/a nM
Citation Kaur, KAeron, SBruhaspathy, MShetty, SJGupta, SHegde, LHSilamkoti, ADMehta, AChugh, AGupta, JBSarma, PKKumar, N Design, synthesis and activity of novel derivatives of oxybutynin and tolterodine. Bioorg Med Chem Lett15:2093-6 (2005) 
 
Muscarinic acetylcholine receptor M2
Name:Muscarinic acetylcholine receptor M2
Type:Enzyme Catalytic Domain
Mol. Mass.:51555.53
Organism:RAT
Description:P10980
Residue:466
BDBM50165012
NameBDBM50165012
Synonyms:CHEMBL192065 | Hydroxy-diphenyl-acetic acid 4-(3-aza-bicyclo[3.1.0]hex-3-yl)-but-2-ynyl ester
TypeSmall organic molecule
Emp. Form.C23H23NO3
Mol. Mass.361.4336
SMILESOC(C(=O)OCC#CCN1CC2CC2C1)(c1ccccc1)c1ccccc1