Reaction Details
TargetMuscarinic acetylcholine receptor M2
LigandBDBM50165016
Substrate/Competitorn/a
Meas. Tech.ChEMBL_302412 (CHEMBL875203)
Ki 34.0±n/a nM
Citation Kaur, KAeron, SBruhaspathy, MShetty, SJGupta, SHegde, LHSilamkoti, ADMehta, AChugh, AGupta, JBSarma, PKKumar, N Design, synthesis and activity of novel derivatives of oxybutynin and tolterodine. Bioorg Med Chem Lett15:2093-6 (2005) 
 
Muscarinic acetylcholine receptor M2
Name:Muscarinic acetylcholine receptor M2
Type:Enzyme Catalytic Domain
Mol. Mass.:51555.53
Organism:RAT
Description:P10980
Residue:466
BDBM50165016
NameBDBM50165016
Synonyms:4-Methyl-2-[3-((1R,5S)-2-methyl-3-aza-bicyclo[3.1.0]hex-3-yl)-1-phenyl-propyl]-phenol | CHEMBL192061
TypeSmall organic molecule
Emp. Form.C22H27NO
Mol. Mass.321.4559
SMILESCC1[C@@H]2C[C@@H]2CN1CCC(c1ccccc1)c1cc(C)ccc1O