Reaction Details
TargetAdenosine receptor A2a
LigandBDBM50165056
Substrate/Competitorn/a
Meas. Tech.ChEMBL_303597 (CHEMBL829686)
Ki 20.5±n/a nM
Citation Kiselgof, ETulshian, DBArik, LZhang, HFawzi, A 6-(2-Furanyl)-9H-purin-2-amine derivatives as A2A adenosine antagonists. Bioorg Med Chem Lett15:2119-22 (2005) 
 
Adenosine receptor A2a
Name:Adenosine receptor A2a
Type:G Protein-Coupled Receptor (GPCR)
Mol. Mass.:44716.46
Organism:Homo sapiens (Human)
Description:P29274
Residue:412
BDBM50165056
NameBDBM50165056
Synonyms:6-Furan-2-yl-9-(4-trifluoromethyl-benzyl)-9H-purin-2-ylamine CHEMBL424827
TypeSmall organic molecule
Emp. Form.C17H12F3N5O
Mol. Mass.359.3053
SMILESNc1nc(-c2ccco2)c2ncn(Cc3ccc(cc3)C(F)(F)F)c2n1