Reaction Details
TargetAdenosine receptor A2a
LigandBDBM50165067
Substrate/Competitorn/a
Meas. Tech.ChEMBL_303597 (CHEMBL829686)
Ki 5.6±n/a nM
Citation Kiselgof, ETulshian, DBArik, LZhang, HFawzi, A 6-(2-Furanyl)-9H-purin-2-amine derivatives as A2A adenosine antagonists. Bioorg Med Chem Lett15:2119-22 (2005) 
 
Adenosine receptor A2a
Name:Adenosine receptor A2a
Type:G Protein-Coupled Receptor (GPCR)
Mol. Mass.:44716.46
Organism:Homo sapiens (Human)
Description:P29274
Residue:412
BDBM50165067
NameBDBM50165067
Synonyms:6-Furan-2-yl-9-naphthalen-1-ylmethyl-9H-purin-2-ylamine | CHEMBL193613
TypeSmall organic molecule
Emp. Form.C20H15N5O
Mol. Mass.341.366
SMILESNc1nc(-c2ccco2)c2ncn(Cc3cccc4ccccc34)c2n1