Reaction Details
TargetC-C chemokine receptor type 5
LigandBDBM50165072
Substrate/Competitorn/a
Meas. Tech.ChEMBL_305950 (CHEMBL832790)
IC50 0.3±n/a nM
Citation Kim, DWang, LHale, JJLynch, CLBudhu, RJMaccoss, MMills, SGMalkowitz, LGould, SLDeMartino, JASpringer, MSHazuda, DMiller, MKessler, JHrin, RCCarver, GCarella, AHenry, KLineberger, JSchleif, WAEmini, EA Potent 1,3,4-trisubstituted pyrrolidine CCR5 receptor antagonists: effects of fused heterocycles on antiviral activity and pharmacokinetic properties. Bioorg Med Chem Lett15:2129-34 (2005) 
 
C-C chemokine receptor type 5
Name:C-C chemokine receptor type 5
Type:Enzyme
Mol. Mass.:40540.21
Organism:Homo sapiens (Human)
Description:P51681
Residue:352
BDBM50165072
NameBDBM50165072
Synonyms:(R)-3-Cyclobutyl-2-[(3S,4S)-3-[4-(6-fluoro-imidazo[1,2-a]pyridin-3-yl)-piperidin-1-ylmethyl]-4-(3-fluoro-phenyl)-pyrrolidin-1-yl]-propionic acid | CHEMBL194497
TypeSmall organic molecule
Emp. Form.C30H36F2N4O2
Mol. Mass.522.6292
SMILESOC(=O)[C@@H](CC1CCC1)N1C[C@H](CN2CCC(CC2)c2cnc3ccc(F)cn23)[C@H](C1)c1cccc(F)c1