Reaction Details
TargetC-C chemokine receptor type 5
LigandBDBM50410168
Substrate/Competitorn/a
Meas. Tech.ChEMBL_305950 (CHEMBL832790)
IC50 0.42±n/a nM
Citation Kim, DWang, LHale, JJLynch, CLBudhu, RJMaccoss, MMills, SGMalkowitz, LGould, SLDeMartino, JASpringer, MSHazuda, DMiller, MKessler, JHrin, RCCarver, GCarella, AHenry, KLineberger, JSchleif, WAEmini, EA Potent 1,3,4-trisubstituted pyrrolidine CCR5 receptor antagonists: effects of fused heterocycles on antiviral activity and pharmacokinetic properties. Bioorg Med Chem Lett15:2129-34 (2005) 
 
C-C chemokine receptor type 5
Name:C-C chemokine receptor type 5
Type:Enzyme
Mol. Mass.:40540.21
Organism:Homo sapiens (Human)
Description:P51681
Residue:352
BDBM50410168
NameBDBM50410168
Synonyms:CHEMBL2113086
TypeSmall organic molecule
Emp. Form.C30H37FN4O2
Mol. Mass.504.6388
SMILESOC(=O)[C@@H](CC1CCC1)N1C[C@H](CN2CCC(CC2)c2cnc3ccccn23)[C@H](C1)c1cccc(F)c1