Reaction Details
TargetGlucocorticoid receptor
LigandBDBM19202
Substrate/Competitorn/a
Meas. Tech.ChEMBL_306249 (CHEMBL831159)
IC50 0.8±n/a nM
Citation Thompson, CFQuraishi, NAli, ATata, JRHammond, MLBalkovec, JMEinstein, MGe, LHarris, GKelly, TMMazur, PPandit, SSantoro, JSitlani, AWang, CWilliamson, JMiller, DKYamin, TTThompson, CMO'Neill, EAZaller, DForrest, MJCarballo-Jane, ELuell, S Novel heterocyclic glucocorticoids: in vitro profile and in vivo efficacy. Bioorg Med Chem Lett15:2163-7 (2005) 
 
Glucocorticoid receptor
Name:Glucocorticoid receptor
Type:Enzyme
Mol. Mass.:85656.87
Organism:Homo sapiens (Human)
Description:P04150
Residue:777
BDBM19202
NameBDBM19202
Synonyms:(1S)-1-[(4aR,5S)-1-(4-fluorophenyl)-4a-methyl-1H,4H,4aH,5H,6H,7H,8H-cyclohexa[f]indazol-5-yl]-1-(thiophen-3-yl)ethan-1-ol N-Arylpyrazolo[3,2-c]-Based Ligand, 25
TypeSmall organic molecule
Emp. Form.C24H25FN2OS
Mol. Mass.408.532
SMILES[H][C@@]1(CCCC2=Cc3c(C[C@]12C)cnn3-c1ccc(F)cc1)[C@](C)(O)c1ccsc1