Reaction Details
TargetPoly [ADP-ribose] polymerase 1
LigandBDBM27660
Substrate/Competitorn/a
Meas. Tech.ChEMBL_305621 (CHEMBL829484)
IC50 770±n/a nM
Citation Loh, VMCockcroft, XLDillon, KJDixon, LDrzewiecki, JEversley, PJGomez, SHoare, JKerrigan, FMatthews, ITMenear, KAMartin, NMNewton, RFPaul, JSmith, GCVile, JWhittle, AJ Phthalazinones. Part 1: The design and synthesis of a novel series of potent inhibitors of poly(ADP-ribose)polymerase. Bioorg Med Chem Lett15:2235-8 (2005) 
 
Poly [ADP-ribose] polymerase 1
Name:Poly [ADP-ribose] polymerase 1
Type:n/a
Mol. Mass.:113114.22
Organism:Homo sapiens (Human)
Description:P09874
Residue:1014
BDBM27660
NameBDBM27660
Synonyms:4-Benzyl-2H-phthalazin-1-one 4-benzylphthalazin-1(2H)-one US20230159469, Example 143 | phthalazinone, 1
TypeSmall organic molecule
Emp. Form.C15H12N2O
Mol. Mass.236.2686
SMILESO=c1[nH]nc(Cc2ccccc2)c2ccccc12