Reaction Details
TargetPoly [ADP-ribose] polymerase 1
LigandBDBM50165496
Substrate/Competitorn/a
Meas. Tech.ChEMBL_305621 (CHEMBL829484)
IC50 3.8±n/a nM
Citation Loh, VMCockcroft, XLDillon, KJDixon, LDrzewiecki, JEversley, PJGomez, SHoare, JKerrigan, FMatthews, ITMenear, KAMartin, NMNewton, RFPaul, JSmith, GCVile, JWhittle, AJ Phthalazinones. Part 1: The design and synthesis of a novel series of potent inhibitors of poly(ADP-ribose)polymerase. Bioorg Med Chem Lett15:2235-8 (2005) 
 
Poly [ADP-ribose] polymerase 1
Name:Poly [ADP-ribose] polymerase 1
Type:n/a
Mol. Mass.:113114.22
Organism:Homo sapiens (Human)
Description:P09874
Residue:1014
BDBM50165496
NameBDBM50165496
Synonyms:1-(2-fluoro-5-((4-oxo-3,4-dihydrophthalazin-1-yl)methyl)phenyl)-3-methylpyrrolidine-2,5-dione CHEMBL370838
TypeSmall organic molecule
Emp. Form.C20H16FN3O3
Mol. Mass.365.3577
SMILESCc1cc(O)n(c1O)-c1cc(Cc2n[nH]c(=O)c3ccccc23)ccc1F