Reaction Details
TargetGonadotropin-releasing hormone receptor
LigandBDBM50165551
Substrate/Competitorn/a
Meas. Tech.ChEMBL_305152 (CHEMBL832604)
IC50 37±n/a nM
Citation Tatsuta, MKataoka, MYasoshima, KSakakibara, SShogase, YShimazaki, MYura, TLi, YYamamoto, NGupta, JUrbahns, K Benzimidazoles as non-peptide luteinizing hormone-releasing hormone (LHRH) antagonists. Part 3: Discovery of 1-(1H-benzimidazol-5-yl)-3-tert-butylurea derivatives. Bioorg Med Chem Lett15:2265-9 (2005) 
 
Gonadotropin-releasing hormone receptor
Name:Gonadotropin-releasing hormone receptor
Type:Enzyme
Mol. Mass.:37749.45
Organism:Homo sapiens (Human)
Description:P30968
Residue:328
BDBM50165551
NameBDBM50165551
Synonyms:6-(3-tert-Butyl-ureido)-2-(2-methoxy-5-nitro-benzylsulfanyl)-3-propyl-3H-benzoimidazole-4-carboxylic acid methyl ester | CHEMBL196079
TypeSmall organic molecule
Emp. Form.C25H31N5O6S
Mol. Mass.529.609
SMILESCCCn1c(SCc2cc(ccc2OC)[N+]([O-])=O)nc2cc(NC(=O)NC(C)(C)C)cc(C(=O)OC)c12