Reaction Details
TargetGonadotropin-releasing hormone receptor
LigandBDBM50165528
Substrate/Competitorn/a
Meas. Tech.ChEMBL_305068 (CHEMBL832700)
IC50 23±n/a nM
Citation Tatsuta, MKataoka, MYasoshima, KSakakibara, SShogase, YShimazaki, MYura, TLi, YYamamoto, NGupta, JUrbahns, K Benzimidazoles as non-peptide luteinizing hormone-releasing hormone (LHRH) antagonists. Part 3: Discovery of 1-(1H-benzimidazol-5-yl)-3-tert-butylurea derivatives. Bioorg Med Chem Lett15:2265-9 (2005) 
 
Gonadotropin-releasing hormone receptor
Name:Gonadotropin-releasing hormone receptor
Type:PROTEIN
Mol. Mass.:37767.60
Organism:Rattus norvegicus
Description:ChEMBL_1335047
Residue:327
BDBM50165528
NameBDBM50165528
Synonyms:6-(3-tert-Butyl-ureido)-2-(2-methoxy-5-nitro-benzylsulfanyl)-3-propyl-3H-benzoimidazole-4-carboxylic acid methylamide | CHEMBL440212
TypeSmall organic molecule
Emp. Form.C25H32N6O5S
Mol. Mass.528.624
SMILESCCCn1c(SCc2cc(ccc2OC)[N+]([O-])=O)nc2cc(NC(=O)NC(C)(C)C)cc(C(=O)NC)c12