Reaction Details
TargetHeparanase
LigandBDBM50165660
Substrate/Competitorn/a
Meas. Tech.ChEMBL_305497 (CHEMBL831099)
IC50 200±n/a nM
Citation Courtney, SMHay, PABuck, RTColville, CSPhillips, DJScopes, DIPollard, FCPage, MJBennett, JMHircock, MLMcKenzie, EABhaman, MFelix, RStubberfield, CRTurner, PR Furanyl-1,3-thiazol-2-yl and benzoxazol-5-yl acetic acid derivatives: novel classes of heparanase inhibitor. Bioorg Med Chem Lett15:2295-9 (2005) 
 
Heparanase
Name:Heparanase
Type:PROTEIN
Mol. Mass.:61167.67
Organism:Homo sapiens (Human)
Description:ChEMBL_327900
Residue:543
BDBM50165660
NameBDBM50165660
Synonyms:2-(3-(5-(4-chlorophenyl)benzo[d]oxazol-2-yl)-4-(propylamino)phenyl)-1,3-dioxoisoindoline-5-carboxylic acid CHEMBL193906
TypeSmall organic molecule
Emp. Form.C31H22ClN3O5
Mol. Mass.551.976
SMILESCCCNc1ccc(cc1-c1nc2cc(ccc2o1)-c1ccc(Cl)cc1)N1C(=O)c2ccc(cc2C1=O)C(O)=O