Reaction Details
TargetHeparanase
LigandBDBM50165627
Substrate/Competitorn/a
Meas. Tech.ChEMBL_305497 (CHEMBL831099)
IC50 300±n/a nM
Citation Courtney, SMHay, PABuck, RTColville, CSPhillips, DJScopes, DIPollard, FCPage, MJBennett, JMHircock, MLMcKenzie, EABhaman, MFelix, RStubberfield, CRTurner, PR Furanyl-1,3-thiazol-2-yl and benzoxazol-5-yl acetic acid derivatives: novel classes of heparanase inhibitor. Bioorg Med Chem Lett15:2295-9 (2005) 
 
Heparanase
Name:Heparanase
Type:PROTEIN
Mol. Mass.:61167.67
Organism:Homo sapiens (Human)
Description:ChEMBL_327900
Residue:543
BDBM50165627
NameBDBM50165627
Synonyms:(2-{4-[2-(3-Fluoro-4-methoxy-phenylcarbamoyl)-vinyl]-phenyl}-benzooxazol-5-yl)-acetic acid CHEMBL383774
TypeSmall organic molecule
Emp. Form.C25H19FN2O5
Mol. Mass.446.4272
SMILESCOc1ccc(NC(=O)\C=C\c2ccc(cc2)-c2nc3cc(CC(O)=O)ccc3o2)cc1F