Reaction Details
TargetHeparanase
LigandBDBM50165669
Substrate/Competitorn/a
Meas. Tech.ChEMBL_305497 (CHEMBL831099)
IC50 200±n/a nM
Citation Courtney, SMHay, PABuck, RTColville, CSPhillips, DJScopes, DIPollard, FCPage, MJBennett, JMHircock, MLMcKenzie, EABhaman, MFelix, RStubberfield, CRTurner, PR Furanyl-1,3-thiazol-2-yl and benzoxazol-5-yl acetic acid derivatives: novel classes of heparanase inhibitor. Bioorg Med Chem Lett15:2295-9 (2005) 
 
Heparanase
Name:Heparanase
Type:PROTEIN
Mol. Mass.:61167.67
Organism:Homo sapiens (Human)
Description:ChEMBL_327900
Residue:543
BDBM50165669
NameBDBM50165669
Synonyms:(2-{4-[2-(3-Bromo-phenylcarbamoyl)-vinyl]-2-fluoro-phenyl}-benzooxazol-5-yl)-acetic acid CHEMBL193625
TypeSmall organic molecule
Emp. Form.C24H16BrFN2O4
Mol. Mass.495.297
SMILESOC(=O)Cc1ccc2oc(nc2c1)-c1ccc(\C=C\C(=O)Nc2cccc(Br)c2)cc1F