Reaction Details
TargetHeparanase
LigandBDBM50165640
Substrate/Competitorn/a
Meas. Tech.ChEMBL_305497 (CHEMBL831099)
IC50 300±n/a nM
Citation Courtney, SMHay, PABuck, RTColville, CSPhillips, DJScopes, DIPollard, FCPage, MJBennett, JMHircock, MLMcKenzie, EABhaman, MFelix, RStubberfield, CRTurner, PR Furanyl-1,3-thiazol-2-yl and benzoxazol-5-yl acetic acid derivatives: novel classes of heparanase inhibitor. Bioorg Med Chem Lett15:2295-9 (2005) 
 
Heparanase
Name:Heparanase
Type:PROTEIN
Mol. Mass.:61167.67
Organism:Homo sapiens (Human)
Description:ChEMBL_327900
Residue:543
BDBM50165640
NameBDBM50165640
Synonyms:2-(4-(5-(2-chloro-4-(3-(2,4-dichlorophenyl)acrylamido)phenyl)furan-2-yl)thiazol-2-yl)acetic acid [4-(5-{2-Chloro-4-[3-(2,4-dichloro-phenyl)-acryloylamino]-phenyl}-furan-2-yl)-thiazol-2-yl]-acetic acid
TypeSmall organic molecule
Emp. Form.C24H15Cl3N2O4S
Mol. Mass.533.811
SMILESOC(=O)Cc1nc(cs1)-c1ccc(o1)-c1ccc(NC(=O)\C=C\c2ccc(Cl)cc2Cl)cc1Cl