Reaction Details
TargetDual 3',5'-cyclic-AMP and -GMP phosphodiesterase 11A
LigandBDBM14777
Substrate/Competitorn/a
Meas. Tech.ChEMBL_305103 (CHEMBL876977)
IC50 33±n/a nM
Citation Boyle, CDXu, RAsberom, TChackalamannil, SClader, JWGreenlee, WJGuzik, HHu, YHu, ZLankin, CMPissarnitski, DAStamford, AWWang, YSkell, JKurowski, SVemulapalli, SPalamanda, JChintala, MWu, PMyers, JWang, P Optimization of purine based PDE1/PDE5 inhibitors to a potent and selective PDE5 inhibitor for the treatment of male ED. Bioorg Med Chem Lett15:2365-9 (2005) 
 
Dual 3',5'-cyclic-AMP and -GMP phosphodiesterase 11A
Name:Dual 3',5'-cyclic-AMP and -GMP phosphodiesterase 11A
Type:Enzyme
Mol. Mass.:104751.53
Organism:Homo sapiens (Human)
Description:Q9HCR9
Residue:933
BDBM14777
NameBDBM14777
Synonyms:(2R,8R)-2-(2H-1,3-benzodioxol-5-yl)-6-methyl-3,6,17-triazatetracyclo[8.7.0.0^{3,8}.0^{11,16}]heptadeca-1(10),11(16),12,14-tetraene-4,7-dione CHEMBL779 GF 196960 | Tadalafil
TypeSmall organic molecule
Emp. Form.C22H19N3O4
Mol. Mass.389.404
SMILES[H][C@]12Cc3c([nH]c4ccccc34)[C@H](N1C(=O)CN(C)C2=O)c1ccc2OCOc2c1