Reaction Details
TargetB1 bradykinin receptor
LigandBDBM50410175
Substrate/Competitorn/a
Meas. Tech.ChEMBL_302988 (CHEMBL830227)
Ki 1.8±n/a nM
Citation Feng, DMWai, JMKuduk, SDNg, CMurphy, KLRansom, RWReiss, DChang, RSHarrell, CMMacNeil, TTang, CPrueksaritanont, TFreidinger, RMPettibone, DJBock, MG 2,3-Diaminopyridine as a platform for designing structurally unique nonpeptide bradykinin B1 receptor antagonists. Bioorg Med Chem Lett15:2385-8 (2005) 
 
B1 bradykinin receptor
Name:B1 bradykinin receptor
Type:Enzyme
Mol. Mass.:40508.87
Organism:Homo sapiens (Human)
Description:P46663
Residue:353
BDBM50410175
NameBDBM50410175
Synonyms:CHEMBL2113087
TypeSmall organic molecule
Emp. Form.C25H24F3N3O3
Mol. Mass.471.4716
SMILESCOC(=O)c1ccccc1-c1ccc(cc1)[C@@H](C)Nc1nccc(C)c1NC(=O)CC(F)(F)F